[ERROR] BUILD FAILURE
Error recorded 6 times in PanelAlpha Engine deploys on Java. The deploy log below is the recorded failure output.
TypeErrorAn error that occurred in the deployed application. It is not necessarily a PanelAlpha Engine error, but we keep working on improvements so you run into fewer of them.
Seen6 times · 6 variants
WhereJava
StatusObservedOur team will look into this soon, verify the cause and try to fix it in an upcoming release.
What the log looks like
Deploy log
[ERROR] BUILD FAILURE[ERROR] Failed to execute goal org.apache.maven.plugins:maven-compiler-plugin:3.1:compile (default-compile) on project campus-common: Fatal error compiling: java.lang.NoSuchFieldError: Class com.sun.tools.javac.tree.JCTree$JCImport does not have member field 'com.sun.tools.javac.tree.JCTree qualid' -> [Help 1][ERROR][ERROR] To see the full stack trace of the errors, re-run Maven with the -e switch.[ERROR] Re-run Maven using the -X switch to enable full debug logging.[ERROR][ERROR] For more information about the errors and possible solutions, please read the following…